{"text_format":"1","workbook":"xlsx","n_sheets":14,"sheets":["Front page","Introduction","User Interface","Results","Finance","Technical data","CAPEX & OPEX","Exchange rate","Inflation","Sensitivity","Result tables","Data transformation ","Lists","Abbreviations"],"not_rendered":{"charts":15,"images":5,"macros":1,"external_links":0,"defined_names":144,"comments":0,"pivot_tables":0},"unopened":[],"bounds":{"document_bytes":16777216,"sheet_cells":100000,"rows_first":2000,"rows_last":500,"rows_between":2000,"halvings":0,"cell_chars":16384,"cell_head_chars":4096},"cells_cut":0,"cells_raw":0,"read":"whole","date_system":"1900"}

{"sheet":"Front page","index":0,"n_rows":52,"n_cols":5,"rows_kept":52,"cut":false,"hidden":false,"merged":[[48,4,49,9],[51,4,52,9],[32,4,33,9],[18,4,19,9],[21,4,22,9],[24,4,25,9],[29,4,30,9]]}
[]
[]
[]
[]
[]
[]
[]
[]
[]
[]
{"$rows_left_out":43}
{"sheet":"Introduction","index":1,"n_rows":31,"n_cols":4,"rows_kept":31,"cut":false,"hidden":false,"merged":[]}
[null,{"$f":"MID(CELL(\"filename\",A1),1+FIND(\"]\",CELL(\"filename\",A1)),99)","v":"Introduction"}]
[]
[]
[null,null,null,"Introduction to the spreadsheet/model"]
[]
[]
[]
[]
[]
[]
{"$rows_left_out":22}
{"sheet":"User Interface","index":2,"n_rows":205,"n_cols":7,"rows_kept":205,"cut":false,"hidden":false,"merged":[[157,3,157,4],[163,3,163,4],[141,3,141,4],[142,3,142,4],[146,3,146,4],[145,3,145,4],[147,3,147,4],[75,3,75,4],[131,3,131,4],[132,3,132,4],[137,3,137,4],[140,3,140,4],[104,3,104,4],[89,3,89,4],[81,3,81,4],[82,3,82,4],[80,3,80,4],[88,3,88,4],[87,3,87,4],[12,3,12,4],[13,3,13,4],[14,3,14,4],[15,3,15,4],[25,3,25,4],[64,3,64,4],[65,3,65,4],[70,3,70,4],[26,3,26,4],[20,3,20,4],[21,3,21,4],[28,3,28,4],[27,3,27,4]]}
[null,{"$f":"MID(CELL(\"filename\",A1),1+FIND(\"]\",CELL(\"filename\",A1)),99)","v":"User Interface"}]
[]
[]
[]
[]
[null,"Generation technology"]
[]
[null,"Technology",null,"Energy Production "]
[null,2,null,1]
[]
{"$rows_left_out":196}
{"sheet":"Results","index":3,"n_rows":154,"n_cols":17,"rows_kept":154,"cut":false,"hidden":false,"merged":[]}
[null,{"$f":"MID(CELL(\"filename\",A1),1+FIND(\"]\",CELL(\"filename\",A1)),99)","v":"Results"}]
[]
[null,"Main Results"]
[]
[null,"Key indicators",null,null,null,null,null,null,"Cost year"]
[null,null,"(million INR)","(million USD)",null,null,null,null,{"$f":"'User Interface'!D14","v":2025}]
[null,{"$f":"Finance!D68","v":"CAPEX/MW excl. Taxes"},{"$f":"Finance!F68","v":207.51906875000003},{"$f":"Finance!G68","v":2.85}]
[null,{"$f":"Finance!D69","v":"CAPEX/MW incl. Taxes"},{"$f":"Finance!F69","v":207.51906875000006},{"$f":"Finance!G69","v":2.8500000000000005}]
[null,null,"(INR/KWh)","(USD/KWh)"]
[null,{"$f":"Finance!D70","v":"First year OPEX/MWh"},{"$f":"Finance!F70/1000","v":1.2023199212746056},{"$f":"Finance!G70/1000","v":1.6512274251580677E-2}]
{"$rows_left_out":145}
{"sheet":"Finance","index":4,"n_rows":86,"n_cols":37,"rows_kept":86,"cut":false,"hidden":false,"merged":[]}
[null,{"$f":"MID(CELL(\"filename\",A1),1+FIND(\"]\",CELL(\"filename\",A1)),99)","v":"Finance"}]
[]
[null,null,null,"Calender Year",null,{"$f":"[0]!constr_start","v":2025},{"$f":"F3+1","v":2026},{"$f":"G3+1","v":2027},2028,2029,2030,2031,2032,2033,2034,2035,2036,2037,2038,2039,2040,2041,2042,2043,2044,2045,2046,2047,2048,2049,2050,2051,2052,2053,2054,2055,2056]
[null,null,null,"Project Phase",null,{"$f":"IF(AND(F5=1,delay_months>0)=TRUE,\"Development and market\",IF(F5<=0,INDEX(Phases,1),IF(F5<=T_life,INDEX(Phases,2),IF(F5<=T_life+1,INDEX(Phases,3),\"\"))))","v":"Development"},"Development","Development","Development","Operation: Market","Operation: Market","Operation: Market","Operation: Market","Operation: Market","Operation: Market","Operation: Market","Operation: Market","Operation: Market","Operation: Market","Operation: Market","Operation: Market","Operation: Market","Operation: Market","Operation: Market","Operation: Market","Operation: Market","Operation: Market","Operation: Market","Operation: Market","Operation: Market","Operation: Market","Operation: Market","Operation: Market","Operation: Market","Operation: Market","Operation: Market","Liquidation"]
[null,null,null,"Model Period",null,{"$f":"IF(F3<=constr_start+constr_dur+T_life+Delay_years,ROUND(Finance!F3-(constr_start+constr_dur+Delay_years-1),0),\"\")","v":-3},{"$f":"IF(G3<=constr_start+constr_dur+T_life+Delay_years,ROUND(Finance!G3-(constr_start+constr_dur+Delay_years-1),0),\"\")","v":-2},{"$f":"IF(H3<=constr_start+constr_dur+T_life+Delay_years,ROUND(Finance!H3-(constr_start+constr_dur+Delay_years-1),0),\"\")","v":-1},{"$f":"IF(I3<=constr_start+constr_dur+T_life+Delay_years,ROUND(Finance!I3-(constr_start+constr_dur+Delay_years-1),0),\"\")","v":0},{"$f":"IF(J3<=constr_start+constr_dur+T_life+Delay_years,ROUND(Finance!J3-(constr_start+constr_dur+Delay_years-1),0),\"\")","v":1},{"$f":"IF(K3<=constr_start+constr_dur+T_life+Delay_years,ROUND(Finance!K3-(constr_start+constr_dur+Delay_years-1),0),\"\")","v":2},{"$f":"IF(L3<=constr_start+constr_dur+T_life+Delay_years,ROUND(Finance!L3-(constr_start+constr_dur+Delay_years-1),0),\"\")","v":3},{"$f":"IF(M3<=constr_start+constr_dur+T_life+Delay_years,ROUND(Finance!M3-(constr_start+constr_dur+Delay_years-1),0),\"\")","v":4},{"$f":"IF(N3<=constr_start+constr_dur+T_life+Delay_years,ROUND(Finance!N3-(constr_start+constr_dur+Delay_years-1),0),\"\")","v":5},{"$f":"IF(O3<=constr_start+constr_dur+T_life+Delay_years,ROUND(Finance!O3-(constr_start+constr_dur+Delay_years-1),0),\"\")","v":6},{"$f":"IF(P3<=constr_start+constr_dur+T_life+Delay_years,ROUND(Finance!P3-(constr_start+constr_dur+Delay_years-1),0),\"\")","v":7},{"$f":"IF(Q3<=constr_start+constr_dur+T_life+Delay_years,ROUND(Finance!Q3-(constr_start+constr_dur+Delay_years-1),0),\"\")","v":8},{"$f":"IF(R3<=constr_start+constr_dur+T_life+Delay_years,ROUND(Finance!R3-(constr_start+constr_dur+Delay_years-1),0),\"\")","v":9},{"$f":"IF(S3<=constr_start+constr_dur+T_life+Delay_years,ROUND(Finance!S3-(constr_start+constr_dur+Delay_years-1),0),\"\")","v":10},{"$f":"IF(T3<=constr_start+constr_dur+T_life+Delay_years,ROUND(Finance!T3-(constr_start+constr_dur+Delay_years-1),0),\"\")","v":11},{"$f":"IF(U3<=constr_start+constr_dur+T_life+Delay_years,ROUND(Finance!U3-(constr_start+constr_dur+Delay_years-1),0),\"\")","v":12},{"$f":"IF(V3<=constr_start+constr_dur+T_life+Delay_years,ROUND(Finance!V3-(constr_start+constr_dur+Delay_years-1),0),\"\")","v":13},{"$f":"IF(W3<=constr_start+constr_dur+T_life+Delay_years,ROUND(Finance!W3-(constr_start+constr_dur+Delay_years-1),0),\"\")","v":14},{"$f":"IF(X3<=constr_start+constr_dur+T_life+Delay_years,ROUND(Finance!X3-(constr_start+constr_dur+Delay_years-1),0),\"\")","v":15},{"$f":"IF(Y3<=constr_start+constr_dur+T_life+Delay_years,ROUND(Finance!Y3-(constr_start+constr_dur+Delay_years-1),0),\"\")","v":16},{"$f":"IF(Z3<=constr_start+constr_dur+T_life+Delay_years,ROUND(Finance!Z3-(constr_start+constr_dur+Delay_years-1),0),\"\")","v":17},{"$f":"IF(AA3<=constr_start+constr_dur+T_life+Delay_years,ROUND(Finance!AA3-(constr_start+constr_dur+Delay_years-1),0),\"\")","v":18},{"$f":"IF(AB3<=constr_start+constr_dur+T_life+Delay_years,ROUND(Finance!AB3-(constr_start+constr_dur+Delay_years-1),0),\"\")","v":19},{"$f":"IF(AC3<=constr_start+constr_dur+T_life+Delay_years,ROUND(Finance!AC3-(constr_start+constr_dur+Delay_years-1),0),\"\")","v":20},{"$f":"IF(AD3<=constr_start+constr_dur+T_life+Delay_years,ROUND(Finance!AD3-(constr_start+constr_dur+Delay_years-1),0),\"\")","v":21},{"$f":"IF(AE3<=constr_start+constr_dur+T_life+Delay_years,ROUND(Finance!AE3-(constr_start+constr_dur+Delay_years-1),0),\"\")","v":22},{"$f":"IF(AF3<=constr_start+constr_dur+T_life+Delay_years,ROUND(Finance!AF3-(constr_start+constr_dur+Delay_years-1),0),\"\")","v":23},{"$f":"IF(AG3<=constr_start+constr_dur+T_life+Delay_years,ROUND(Finance!AG3-(constr_start+constr_dur+Delay_years-1),0),\"\")","v":24},{"$f":"IF(AH3<=constr_start+constr_dur+T_life+Delay_years,ROUND(Finance!AH3-(constr_start+constr_dur+Delay_years-1),0),\"\")","v":25},{"$f":"IF(AI3<=constr_start+constr_dur+T_life+Delay_years,ROUND(Finance!AI3-(constr_start+constr_dur+Delay_years-1),0),\"\")","v":26},{"$f":"IF(AJ3<=constr_start+constr_dur+T_life+Delay_years,ROUND(Finance!AJ3-(constr_start+constr_dur+Delay_years-1),0),\"\")","v":27},{"$f":"IF(AK3<=constr_start+constr_dur+T_life+Delay_years,ROUND(Finance!AK3-(constr_start+constr_dur+Delay_years-1),0),\"\")","v":28}]
[null,null,null,"Project Phasing"]
[null,null,null,"Development",null,{"$f":"IF(F$4=$D7,1,0)","v":1},{"$f":"IF(G$4=$D7,1,0)","v":1},1,1,0,0,0,0,0,0,0,0,0,0,0,0,0,0,0,0,0,0,0,0,0,0,0,0,0,0,0,0]
[null,null,null,"Operation: Market",null,{"$f":"IF(F$4=$D8,1,0)","v":0},0,0,0,1,1,1,1,1,1,1,1,1,1,1,1,1,1,1,1,1,1,1,1,1,1,1,1,1,1,1,0]
[null,null,null,"Liquidation",null,{"$f":"IF(F$4=$D9,1,0)","v":0},0,0,0,0,0,0,0,0,0,0,0,0,0,0,0,0,0,0,0,0,0,0,0,0,0,0,0,0,0,0,1]
[null,null,null,"Development and market",null,{"$f":"IF(F$4=$D10,1,0)","v":0},0,0,0,0,0,0,0,0,0,0,0,0,0,0,0,0,0,0,0,0,0,0,0,0,0,0,0,0,0,0,0]
{"$rows_left_out":77}
{"sheet":"Technical data","index":5,"n_rows":69,"n_cols":25,"rows_kept":69,"cut":false,"hidden":false,"merged":[]}
[null,{"$f":"MID(CELL(\"filename\",A1),1+FIND(\"]\",CELL(\"filename\",A1)),99)","v":"Technical data"}]
[]
[null,null,null,null,"Value","Index"]
[null,null,null,"Chosen Tech",{"$f":"INDEX($E$9:$H$9,F4)","v":"Offshore wind Tamil Nadu Site B"},{"$f":"Tech_choice","v":2}]
[null,null,null,"Chosen P",null,{"$f":"P_choice","v":1}]
[null,null,null,"Capacity",{"$f":"NCAP","v":500}]
[]
[null,null,null,"Gross AEP"]
[null,null,null,"GWh/MW","Offshore wind Gujarat","Offshore wind Tamil Nadu Site B",null,null,null,"Technical lifetime"]
[null,null,null,2020,3.73,5.0960000000000001,null,null,null,2020,25]
{"$rows_left_out":60}
{"sheet":"CAPEX & OPEX","index":6,"n_rows":44,"n_cols":32,"rows_kept":44,"cut":false,"hidden":false,"merged":[]}
[null,{"$f":"MID(CELL(\"filename\",A1),1+FIND(\"]\",CELL(\"filename\",A1)),99)","v":"CAPEX & OPEX"}]
[]
[null,null,null,null,"Value","Index"]
[null,null,null,"Chosen Tech",{"$f":"INDEX($E$9:$H$9,1,F4)","v":"Offshore wind Tamil Nadu Site B"},{"$f":"Tech_choice","v":2}]
[null,null,null,"Capacity",{"$f":"Nom_cap","v":500}]
[null,null,null,"AEP (MWh)",{"$f":"Net_AEP","v":2344.5513000000001}]
[]
[null,null,null,"CAPEX","Offshore wind Gujarat","Offshore wind Tamil Nadu Site B",null,null,null,null,"Taxes",null,null,null,null,"CAPEX",null,null,null,null,"Export system",null,null,null,null,null,null,"Cost development"]
[null,null,null,"mUSD/MW",{"$f":"'Technical data'!E9","v":"Offshore wind Gujarat"},{"$f":"'Technical data'!F9","v":"Offshore wind Tamil Nadu Site B"},{"$f":"'Technical data'!G9","v":0},{"$f":"'Technical data'!H9","v":0},"Chosen",null,"%","VAT","Duties","Total",null,"mUSD","CAPEX","Taxes","Total",null,null,"% of CAPEX","Include in Export system",null,"Included","Not included",null,null,{"$f":"E9","v":"Offshore wind Gujarat"},{"$f":"F9","v":"Offshore wind Tamil Nadu Site B"},{"$f":"G9","v":0},{"$f":"H9","v":0}]
[null,null,null,"DEVEX",9.6443057021582401E-2,9.2840299144339389E-2,null,null,{"$f":"INDEX($E10:$H10,1,$F$4)*(1+$E$37)","v":7.8983538078020082E-2},null,{"$f":"D10","v":"DEVEX"},0.05,0.13,{"$f":"(1+L10*VAT_choice)*(1+M10*Duties_choice)-1","v":0},null,{"$f":"K10","v":"DEVEX"},{"$f":"I10*$E$5","v":39.491769039010045},{"$f":"Q10*N10","v":0},{"$f":"(Q10+R10)","v":39.491769039010045},null,"OSS",7.1999999999999995E-2,"Yes",{"$f":"V10/SUM($V$10:$V$12)","v":0.41379310344827586},{"$f":"$X10*IF($W10=\"Yes\",1,0)","v":0.41379310344827586},{"$f":"$X10*IF($W10=\"No\",1,0)","v":0},null,2020,0,0]
{"$rows_left_out":35}
{"sheet":"Exchange rate","index":7,"n_rows":594,"n_cols":12,"rows_kept":594,"cut":false,"hidden":false,"merged":[]}
[null,{"$f":"MID(CELL(\"filename\",A1),1+FIND(\"]\",CELL(\"filename\",A1)),99)","v":"Exchange rate"}]
[]
[]
[null,"Date","Indian Rupee/USD",null,null,null,null,null,null,null,null,"INR"]
[null,"1973-01-01",8.0040999999999993,null,{"$f":"B592-B5","v":17866},"Days",null,null,null,null,null,"USD"]
[null,"1973-02-01",7.7538,null,{"$f":"E5/365.25","v":48.91444216290212},"Years"]
[null,"1973-03-01",7.5465]
[null,"1973-04-01",7.5461999999999998]
[null,"1973-05-01",7.4927000000000001]
[null,"1973-06-01",7.2718999999999996,null,"2019-01-01","Startdate"]
{"$rows_left_out":585}
{"sheet":"Inflation","index":8,"n_rows":29,"n_cols":65,"rows_kept":29,"cut":false,"hidden":false,"merged":[[16,2,16,4]]}
[null,{"$f":"MID(CELL(\"filename\",A1),1+FIND(\"]\",CELL(\"filename\",A1)),99)","v":"Inflation"}]
[]
[null,"Inflation - Projection"]
[null,"Inflation, consumer prices (annual %)",null,2000,2001,2002,2003,2004,2005,2006,2007,2008,2009,2010,2011,2012,2013,2014,2015,2016,2017,2018,2019,2020,2021,2022,2023,2024,2025,2026,2027,2028,2029,2030,2031,2032,2033,2034,2035,2036,2037,2038,2039,2040,2041,2042,2043,2044,2045,2046,2047,2048,2049,2050,2051,2052,2053,2054,2055,2056,2057,2058,2059,2060,2061]
[null,null,null,{"$f":"IF(AND(D$4>$K$22,$N$29=2),$F$16,IF(D$4>$K$22,$K$24,INDEX($F$11:$AC$11,MATCH(D$4,$F$10:$AC$10,0))))","v":3.7383199999999999},4.27928,4.1036700000000002,3.7344400000000002,4,4.2307699999999997,6.2,6.4,9.0225600000000004,12.241379999999999,10.44547,10.44547,9.8972700000000007,12.2,5.7932263810000002,4.8862679020000002,4.5783132530000001,3.6866359449999999,3.4,4.8,6.5,5,5,5,5,5,5,5,5,5,5,5,{"$f":"IF(AND(AJ$4>$K$22,$N$29=2),$F$16,IF(AJ$4>$K$22,$K$24,INDEX($F$11:$AC$11,MATCH(AJ$4,$F$10:$AC$10,0))))","v":5},5,5,5,5,5,5,5,5,5,5,5,5,5,5,5,5,5,5,5,5,5,5,5,5,5,5,5,5,5]
[]
[]
[]
[]
[null,null,null,null,null,2000,2001,2002,2003,2004,2005,2006,2007,2008,2009,2010,2011,2012,2013,2014,2015,2016,2017,2018,2019,2020]
{"$rows_left_out":20}
{"sheet":"Sensitivity","index":9,"n_rows":117,"n_cols":24,"rows_kept":117,"cut":false,"hidden":false,"merged":[]}
[null,"Sensitivity"]
[]
[null,null,"No. of scens",{"$f":"MAX(C9:C117)","v":96}]
[null,null,"Active scen",1]
[]
[null,null,"Input",null,null,null,null,null,null,null,null,null,null,null,null,null,null,null,null,"Output"]
[null,null,null,"CAPEX Total","OPEX Total","Net AEP","Lifetime extension","Construction rate","Senior rate","Senior tenor","Junior Tenor","Junior rate","Cost of Equity","Inflation rate ","Technology","Uncertainty",null,null,null,null,"Scen","Technology ","Uncertainty","LCOE"]
[null,null,"Chosen sensitivity",{"$f":"INDEX(D9:D117,Scen)","v":0},{"$f":"INDEX(E9:E117,Scen)","v":0},{"$f":"INDEX(F9:F117,Scen)","v":0},0,0,0,0,{"$f":"INDEX(K9:K117,Scen)","v":0},0,{"$f":"INDEX(M9:M117,Scen)","v":0},{"$f":"INDEX(N9:N117,Scen)*100","v":0},{"$f":"IF(INDEX($O$9:$O$117,Scen)>0,INDEX($O$9:$O$117,Scen),Tech_choice)","v":2},{"$f":"IF(INDEX($P$9:$P$117,Scen)>0,INDEX($P$9:$P$117,Scen),P_choice)","v":1},null,null,null,"Scenario",{"$f":"Scen","v":1},{"$f":"INDEX(Lists!$B$4:$B$7,scen_technology,1)","v":"Offshore wind Tamil Nadu Site B"},{"$f":"INDEX(Lists!D4:D8,Scen_uncertainty,1)","v":"P50"},{"$f":"Results!$C$11","v":7.4265436059532233}]
[null,"Base",1,null,null,null,null,null,null,null,null,null,null,null,null,null,null,null,null,1,1,"Offshore wind Gujarat","P50",13.711062574423666]
[null,null,{"$f":"C9+1","v":2},null,null,-0.1,null,null,null,null,null,null,null,null,1,null,null,null,null,{"$f":"T9+1","v":2},2,"Offshore wind Gujarat","P50",15.234513971581846]
{"$rows_left_out":108}
{"sheet":"Result tables","index":10,"n_rows":119,"n_cols":26,"rows_kept":119,"cut":false,"hidden":false,"merged":[]}
[null,{"$f":"MID(CELL(\"filename\",A1),1+FIND(\"]\",CELL(\"filename\",A1)),99)","v":"Result tables"}]
[]
[]
[]
[null,"LCOE sensitivitu chart"]
[]
[null,"Technology ",{"$f":"'Technical data'!E9","v":"Offshore wind Gujarat"},1,null,null,null,"Technology ",{"$f":"'Technical data'!G9","v":0},3]
[null,"CAPEX base",null,null,null,null,null,"CAPEX base"]
[null,null,null,"LCOE","AEP","Scenario",null,null,null,"LCOE","AEP","Scenario"]
[null,1,{"$f":"Sensitivity!F10","v":-0.1},{"$f":"INDEX(Sensitivity!$X$9:$X$117,'Result tables'!F10)","v":15.234513971581846},{"$f":"INDEX('Technical data'!$L$28:$O$28,,$D$7)*(1+C10)","v":1403.4527325000001},2,null,1,{"$f":"C10","v":-0.1},{"$f":"INDEX(Sensitivity!$X$9:$X$117,'Result tables'!L10)","v":10.917173994130133},{"$f":"INDEX('Technical data'!$L$28:$O$28,,$J$7)*(1+I10)","v":0},26]
{"$rows_left_out":110}
{"sheet":"Data transformation ","index":11,"n_rows":129,"n_cols":9,"rows_kept":129,"cut":false,"hidden":false,"merged":[]}
[null,{"$f":"MID(CELL(\"filename\",A1),1+FIND(\"]\",CELL(\"filename\",A1)),99)","v":"Data transformation "}]
[]
[null,{"$f":"'User Interface'!B6","v":"Generation technology"}]
[]
[null,{"$f":"'User Interface'!B8","v":"Technology"},null,{"$f":"'User Interface'!D8","v":"Energy Production "}]
[null,{"$f":"'User Interface'!B9","v":2},null,{"$f":"'User Interface'!D9","v":1}]
[]
[null,{"$f":"'User Interface'!B11","v":"Dimensioning and timing"}]
[]
[null,{"$f":"'User Interface'!B13","v":"Nominal capacity"},{"$f":"'User Interface'!C13","v":"MW"},{"$f":"'User Interface'!D13","v":500}]
{"$rows_left_out":120}
{"sheet":"Lists","index":12,"n_rows":12,"n_cols":19,"rows_kept":12,"cut":false,"hidden":true,"merged":[]}
[null,{"$f":"MID(CELL(\"filename\",A1),1+FIND(\"]\",CELL(\"filename\",A1)),99)","v":"Lists"}]
[]
[null,"Technologies",null,"Uncertainty","No","PPA tariff","Monthly","Yes","Decreasing value","Cost of Equity",{"$f":"ADDRESS(ROW('User Interface'!$D$132),COLUMN('User Interface'!$D$132),4,1,\"User Interface\")","v":"'User Interface'!D132"},null,"LCOE",null,"CAPEX",null,"Subsidy goalseek ",null,2020]
[null,{"$f":"TRANSPOSE('Technical data'!$E$9:$H$9)","v":"Offshore wind Gujarat"},null,{"$f":"'Technical data'!D28","v":"P50"},"Yes","User defined","Annually","No","Straight line","Senior Debt rate",{"$f":"ADDRESS(ROW('User Interface'!$D$142),COLUMN('User Interface'!$D$142),4,1,\"User Interface\")","v":"'User Interface'!D142"},null,null,null,"OPEX",null,{"$f":"ADDRESS(ROW('User Interface'!D111),COLUMN('User Interface'!D111),4,1,\"User Interface\")","v":"'User Interface'!D111"},null,2025]
[null,"Offshore wind Tamil Nadu Site B",null,{"$f":"'Technical data'!D29","v":"P75"},null,"No compensation",null,null,"Digit sum","SNR Loan Tenure",{"$f":"ADDRESS(ROW('User Interface'!$D$143),COLUMN('User Interface'!$D$143),4,1,\"User Interface\")","v":"'User Interface'!D143"},null,null,null,"WACC",null,{"$f":"ADDRESS(ROW(Results!C11),COLUMN(Results!C11),4,1,\"Results\")","v":"Results!C11"},null,2030]
[null,0,null,{"$f":"'Technical data'!D30","v":"P90"},null,null,null,null,null,null,null,null,null,null,"Equity share"]
[null,0,null,{"$f":"'Technical data'!D31","v":"P95"},null,null,null,null,null,null,null,null,null,null,"PPA tariff",null,"Capacity goalseek "]
[null,null,null,null,null,null,null,null,null,null,null,null,null,null,"Senior rate",null,{"$f":"ADDRESS(ROW(Nom_cap),COLUMN(Nom_cap),4,1,\"User Interface\")","v":"'User Interface'!D13"}]
[null,null,null,null,null,null,null,null,null,null,null,null,null,null,"Senior Tenor",null,{"$f":"ADDRESS(ROW(Finance!$K$71),COLUMN(Finance!$K$71),4,1,\"Finance\")","v":"Finance!K71"}]
[null,null,null,null,null,null,null,null,null,null,null,null,null,null,"Cost of Equity"]
{"$rows_left_out":3}
{"sheet":"Abbreviations","index":13,"n_rows":14,"n_cols":3,"rows_kept":14,"cut":false,"hidden":true,"merged":[]}
[null,{"$f":"MID(CELL(\"filename\",A1),1+FIND(\"]\",CELL(\"filename\",A1)),99)","v":"Abbreviations"}]
[]
[]
[null,"AEP","Annual electricty production"]
[null,"CAPEX","Capital Expenditures"]
[null,"DSRA","Debt-Service reserve account"]
[null,"LCOE","Levelized Cost of Energy"]
[null,"NPV","Net Present Value"]
[null,"OPEX","Operating Expenditures"]
[null,"PPA","Power Purchase Agreement"]
{"$rows_left_out":4}